Target Component
type: Property
comment: Candidate PathwayComponent for the ComponentCondition as determined by applying the RuleSet.
term status: stable
change history: https://credreg.net/ctdl/termhistory/ceterms/targetComponent/json
domain includes: ComponentCondition
range includes: AssessmentComponent
range includes: BasicComponent
range includes: CocurricularComponent
range includes: CompetencyComponent
range includes: CourseComponent
range includes: CredentialComponent
range includes: ExtracurricularComponent
range includes: JobComponent
range includes: WorkExperienceComponent