Target Contact Point
type: Property
comment: Options for contacting the organization or person.
term status: stable
change history: https://credreg.net/ctdl/termhistory/ceterms/targetContactPoint/json
domain includes: CredentialPerson
domain includes: Place
range includes: ContactPoint
equivalent property: contactPoint