Target Metric
type: Property
comment: Metric used to assess whether a condition has been met.
term status: unstable
change history: https://credreg.net/ctdl/termhistory/ceterms/targetMetric/json
domain includes: ConditionProfile
range includes: Metric