Target Node
type: Property
comment: Individual entry in a formally defined framework that is the target of an alignment.
description: The target node returned must be the exact competency or concept being described and no other competency or concept. References to data or a document that returns all of the competencies or concepts in the framework to which the target node belongs should use the ceterms:framework property.
usage note: "Framework" may be interpreted broadly to include any scheme or schema for organizing and referencing resources.
term status: stable
change history: https://credreg.net/ctdl/termhistory/ceterms/targetNode/json
domain includes: AlignmentObject
domain includes: CredentialAlignmentObject
domain includes: FinancialAlignmentObject
range includes: anyURI
equivalent property: targetUrl