Target Description
type: Property
comment: Textual description of an individual concept or competency in a formally defined framework.
term status: stable
change history: https://credreg.net/ctdl/termhistory/ceterms/targetNodeDescription/json
domain includes: CredentialAlignmentObject
domain includes: FinancialAlignmentObject
range includes: langString
equivalent property: targetDescription