Target Description
type: Property
comment: Textual description of an individual entry in a formally defined framework that is the target of an alignment.
usage note: "Framework" may be interpreted broadly to include any scheme or schema for organizing and referencing resources.
term status: stable
change history: https://credreg.net/ctdl/termhistory/ceterms/targetNodeDescription/json
domain includes: AlignmentObject
domain includes: CredentialAlignmentObject
domain includes: FinancialAlignmentObject
range includes: langString
equivalent property: targetDescription