Target Occupation
type: Property
comment: Occupation that is the focus or target of this resource.
term status: unstable
change history: https://credreg.net/ctdl/termhistory/ceterms/targetOccupation/json
domain includes: Rubric
domain includes: ConditionProfile
range includes: Occupation