Target Task
type: Property
comment: Task that is the focus or target of this resource.
term status: unstable
change history: https://credreg.net/ctdl/termhistory/ceterms/targetTask/json
domain includes: RubricCriterion
domain includes: ConditionProfile
range includes: Task