Teaches
type: Property
comment: Competency that the learning opportunity is intended to teach.
term status: stable
change history: https://credreg.net/ctdl/termhistory/ceterms/teaches/json
sub property of: targetCompetency
domain includes: Course
domain includes: LearningOpportunityProfile
domain includes: LearningProgram
range includes: Competency
range includes: CredentialAlignmentObject