Temporal Coverage
type: Property
comment: Indicates the time period to which the entity's content applies or during which it occurres.
description: In the CTDL, the ceterms:temporalCoverage property serves as a super-property for an array of sub-properties defining time-dependent aspects of a resource.
term status: stable
change history: https://credreg.net/ctdl/termhistory/ceterms/temporalCoverage/json
range includes: date
equivalent property: temporalCoverage