Training Offered
type: Property
comment: A profile of a training opportunity offered by the agent.
term status: deprecated
superseded by: offers
change history: https://credreg.net/ctdl/termhistory/ceterms/trainingOffered/json
range includes: LearningOpportunityProfile