Transfer Value Statement Description
type: Property
comment: Description of the nature of transfer value handled by the organization.
term status: stable
change history: https://credreg.net/ctdl/termhistory/ceterms/transferValueStatementDescription/json
domain includes: CredentialOrganization
domain includes: Organization
domain includes: QACredentialOrganization
range includes: langString