Value Endorsement
type: Property
comment: The referenced resource establishes or recommends an equivalent transfer value.
term status: unstable
change history: https://credreg.net/ctdl/termhistory/ceterms/valueEndorsement/json
domain includes: TransferValueProfile
range includes: TransferValueProfile