Verification Directory
type: Property
comment: Directory of credential holders and their current statuses.
term status: stable
change history: https://credreg.net/ctdl/termhistory/ceterms/verificationDirectory/json
domain includes: VerificationServiceProfile
range includes: anyURI