Verification Method Description
type: Property
comment: Textual description of the methods used to evaluate an assessment, learning opportunity, process or verificaiton service for validity or reliability.
term status: stable
change history: https://credreg.net/ctdl/termhistory/ceterms/verificationMethodDescription/json
domain includes: ProcessProfile
domain includes: VerificationServiceProfile
range includes: langString