Verification Service URL
type: Property
comment: Direct access to the verification service.
description: This property identifies machine-accessible services, such as API endpoints, that provide direct access to the verification service being described.
usage note: For general webpages describing the service, use the subjectWebpage property.
term status: stable
change history: https://credreg.net/ctdl/termhistory/ceterms/verificationService/json
domain includes: VerificationServiceProfile
range includes: anyURI