Verified Claim Type
type: Property
comment: Type of claim provided through a verification service; select from an existing enumeration of such types.
usage note: Best practice for developing credential descriptions for the Credential Engine Registry is to use the ceterms:ClaimType vocabulary.
term status: stable
change history: https://credreg.net/ctdl/termhistory/ceterms/verifiedClaimType/json
domain includes: VerificationServiceProfile
range includes: CredentialAlignmentObject
target scheme: ClaimType