Version Identifier
type: Property
comment: Alphanumeric identifier of the version of the credential that is unique within the organizational context of its owner.
description: The credential version captured here is any local identifier used by the credential owner to identify the version of the credential in the its local system.
usage note: Locally unique identifiers are acceptable; however, globally unique URI or GUID/UUID are preferred.
term status: stable
change history: https://credreg.net/ctdl/termhistory/ceterms/versionIdentifier/json
domain includes: ApprenticeshipCertificate
domain includes: AssessmentProfile
domain includes: AssociateDegree
domain includes: BachelorDegree
domain includes: Badge
domain includes: Certificate
domain includes: Certification
domain includes: Credential
domain includes: Degree
domain includes: DigitalBadge
domain includes: Diploma
domain includes: DoctoralDegree
domain includes: GeneralEducationDevelopment
domain includes: JourneymanCertificate
domain includes: LearningOpportunityProfile
domain includes: License
domain includes: MasterCertificate
domain includes: MasterDegree
domain includes: MicroCredential
domain includes: OpenBadge
domain includes: ProfessionalDoctorate
domain includes: QualityAssuranceCredential
domain includes: ResearchDoctorate
domain includes: SecondarySchoolDiploma
range includes: IdentifierValue