Accessible Housing
type: Concept
definition: Housing with features, modifications, or adjustments to ensure that individuals with disabilities can access and use the space on an equal basis with others.
term status: unstable
change history: https://credreg.net/ctdl/termhistory/accommodation/AccessibleHousing/json
broader: FacilityAccommodation
in scheme: Accommodation