Accessible Parking
type: Concept
definition: A designated parking spot close to a building entrance, with adequate space to allow for accessible van or car parking, and with appropriate signage and markings.
term status: unstable
change history: https://credreg.net/ctdl/termhistory/accommodation/AccessibleParking/json
broader: FacilityAccommodation
in scheme: Accommodation