Accessible Restroom
type: Concept
definition: Accessible restrooms with grab bars, accessible toilets, and sinks at different heights.
term status: unstable
change history: https://credreg.net/ctdl/termhistory/accommodation/AccessibleRestroom/json
broader: FacilityAccommodation
in scheme: Accommodation