Assistive Technology
type: Concept
definition: Assistive technology and software to enable or improve access.
term status: unstable
change history: https://credreg.net/ctdl/termhistory/accommodation/AssistiveTechnology/json
broader: ResourceAndServiceAccommodation
in scheme: Accommodation