Audio Captioning
type: Concept
definition: Displays for text corresponding to spoken words and audio cues.
term status: unstable
change history: https://credreg.net/ctdl/termhistory/accommodation/AudioCaptioning/json
broader: FacilityAccommodation
in scheme: Accommodation