Potential Action Status
type: Concept
definition: Description of an action that is supported.
term status: stable
change history: https://credreg.net/ctdl/termhistory/actionStat/PotentialActionStatus/json
in scheme: ActionStatus
top concept of: ActionStatus