Private Not-For-Profit
type: Concept
definition: Sector that contains privately-owned organizations that operate on a non-profit basis.
description: These include both independent not-for-profit schools and those affiliated with a religious organization.
term status: stable
change history: https://credreg.net/ctdl/termhistory/agentSector/PrivateNonProfit/json
in scheme: AgentSector
top concept of: AgentSector