Public
type: Concept
definition: Sector that contains government and quasi-government organizations.
term status: stable
change history: https://credreg.net/ctdl/termhistory/agentSector/Public/json
in scheme: AgentSector
top concept of: AgentSector