Count Distinct
type: Concept
definition: The number of unique values; yields a number.
term status: unstable
change history: https://credreg.net/ctdl/termhistory/array/CountDistinct/json
in scheme: ArrayOperationCategory
top concept of: ArrayOperationCategory