Artifact
type: Concept
definition: Work or product created or produced by the person being assessed.
description: Artifact includes, but is not limited to, an academic paper, video documentary, computer software, music composition, choreography, novel, short story, journal article, news article, report, lesson plan, product design, portfolio, manufactured product, etc. Methods of evaluation may include multiple evaluators either individually or as an expert panel using general criteria or more structured rubrics whose scores are combined, etc. Criteria and methods of evaluation are often very similar to those for assessing a performance, without the facets specific to a live performance
term status: stable
change history: https://credreg.net/ctdl/termhistory/assessMethod/Artifact/json
in scheme: AssessmentMethod
top concept of: AssessmentMethod