Performance
type: Concept
definition: Set of behaviors or actions assessed as demonstration of competencies where the assessment occurs either as the actions take place (i.e., live) or through review of recordings of those actions in a persistent media (e.g., video, audio, keystroke records, etc.)
description: Performance includes, but is not limited to, dance, music, teaching, acting, medical procedures, truck driving, manufacturing production, etc. Criteria include the categories and benchmarks on which the performance is assessed. Methods of evaluation can include multiple evaluators either individually or as an expert panel using general criteria or more structured rubrics whose scores are combined (e.g., assessing a dance performance, evaluating the performance of a medical procedure, truck driving procedure, manufacturing process such as machining).
term status: stable
change history: https://credreg.net/ctdl/termhistory/assessMethod/Performance/json
in scheme: AssessmentMethod
top concept of: AssessmentMethod