Advanced Level
type: Concept
definition: Intended for those with significant experience or expertise where developmental expectations are staged for assessing knowledge, skills, or competencies beyond the novice and intermediate levels.
term status: stable
change history: https://credreg.net/ctdl/termhistory/audLevel/AdvancedLevel/json
in scheme: AudienceLevel
top concept of: AudienceLevel