Bachelors Degree Level
type: Concept
definition: Intended for those completing college/university-level programs within approximately three to four years where course work and activities advance skills from a lower-division or generalist level to an upper-division level.
term status: stable
change history: https://credreg.net/ctdl/termhistory/audLevel/BachelorsDegreeLevel/json
broader: PostSecondaryLevel
in scheme: AudienceLevel