Doctoral Degree Level
type: Concept
definition: Intended for those who have completed Bachelors and Masters degrees or their equivalent and who will be required to complete either independent research or a significant project or paper.
term status: stable
change history: https://credreg.net/ctdl/termhistory/audLevel/DoctoralDegreeLevel/json
broader: PostSecondaryLevel
in scheme: AudienceLevel