Graduate Level
type: Concept
definition: Intended for those who enrolled in a degree program or other formal program above the baccalaureate level, such as a masters or doctoral degree program.
term status: stable
change history: https://credreg.net/ctdl/termhistory/audLevel/GraduateLevel/json
in scheme: AudienceLevel
top concept of: AudienceLevel