Citizen
type: Concept
definition: Person who is a legally recognized subject of a particular nation, state, province, or commonwealth.
term status: stable
change history: https://credreg.net/ctdl/termhistory/audience/Citizen/json
in scheme: Audience
top concept of: Audience