Current Military Dependent
type: Concept
definition: Dependent (usually a child) of a current member of a nation's military.
term status: stable
change history: https://credreg.net/ctdl/termhistory/audience/CurrentMilitaryDependent/json
in scheme: Audience
top concept of: Audience