Current Student
type: Concept
definition: Student currently participating in a learning opportunity.
term status: stable
change history: https://credreg.net/ctdl/termhistory/audience/CurrentStudent/json
in scheme: Audience
top concept of: Audience