Former Military Dependent
type: Concept
definition: Former dependent (usually a child) of a veteran of a nation's military.
term status: stable
change history: https://credreg.net/ctdl/termhistory/audience/FormerMilitaryDependent/json
in scheme: Audience
top concept of: Audience