Former Student / Alumni
type: Concept
definition: Student who previously participated in a learning opportunity.
term status: stable
change history: https://credreg.net/ctdl/termhistory/audience/FormerStudent/json
in scheme: Audience
top concept of: Audience