Full-Time
type: Concept
definition: Participation in a learning opportunity to an extent that meets the opportunity's requirements for full-time status.
term status: stable
change history: https://credreg.net/ctdl/termhistory/audience/FullTime/json
in scheme: Audience
top concept of: Audience