Member
type: Concept
definition: Member of an organization, society, or recognized group.
term status: stable
change history: https://credreg.net/ctdl/termhistory/audience/Member/json
in scheme: Audience
top concept of: Audience