Resident
type: Concept
definition: Person whose permanent and principal home is in a particular nation, state, province, or commonwealth.
term status: stable
change history: https://credreg.net/ctdl/termhistory/audience/Resident/json
in scheme: Audience
top concept of: Audience