Badge Claim
type: Concept
definition: Verifiable visual representation that can be shared, embedded, linked, or otherwise used to publicly indicate that an individual has the represented credential.
term status: stable
change history: https://credreg.net/ctdl/termhistory/claimType/BadgeClaim/json
in scheme: ClaimType
top concept of: ClaimType