Verified Claim
type: Concept
definition: Verifiable representation of the credential holder's credential.
term status: stable
change history: https://credreg.net/ctdl/termhistory/claimType/VerifiedClaim/json
in scheme: ClaimType
top concept of: ClaimType