Verified Claim
type: Concept
definition: Agent service affirms the accuracy of claims of a credential award and its continuing validity.
term status: deprecated
superseded by: VerifiedClaim
change history: https://credreg.net/ctdl/termhistory/claimType/Verifiedclaim/json
in scheme: ClaimType
top concept of: ClaimType