Enrollment Fee
type: Concept
definition: Cost to enroll in the learning opportunity being described.
term status: stable
change history: https://credreg.net/ctdl/termhistory/costType/EnrollmentFee/json
in scheme: CostType
top concept of: CostType