Learning Resource
type: Concept
definition: Cost for one or more learning resources.
description: Examples include resources such as textbooks, workbooks, laboratory supplies, and other related supplies.
term status: stable
change history: https://credreg.net/ctdl/termhistory/costType/LearningResource/json
in scheme: CostType
top concept of: CostType