Meals
type: Concept
definition: Cost for meals while participating in the learning opportunity.
term status: stable
change history: https://credreg.net/ctdl/termhistory/costType/Meals/json
in scheme: CostType
top concept of: CostType