Mixed Fees
type: Concept
definition: The sum of fees that are not identified individually.
term status: stable
change history: https://credreg.net/ctdl/termhistory/costType/MixedFees/json
in scheme: CostType
top concept of: CostType