Optional Charges
type: Concept
definition: Cost for additional fees, other services, equipment, or facilities that are not required.
term status: stable
change history: https://credreg.net/ctdl/termhistory/costType/OptionalCharges/json
in scheme: CostType
top concept of: CostType