Maintenance Fee
type: Concept
definition: Cost for maintenance or renewal of the resource being described.
term status: stable
change history: https://credreg.net/ctdl/termhistory/costType/RenewalFee/json
in scheme: CostType
top concept of: CostType